Target
Botulinum neurotoxin type A2 [1-425]
Ligand
BDBM23288
Substrate
SNAPtide
Meas. Tech.
Evaluation of Inhibitors with Recombinant LC/A
pH
7.4±n/a
Temperature
296.15±n/a K
IC50
25000±6000 nM
Citation
 Capková, KYoneda, YDickerson, TJJanda, KD Synthesis and structure-activity relationships of second-generation hydroxamate botulinum neurotoxin A protease inhibitors. Bioorg Med Chem Lett 17:6463-6 (2007)  
Target
Name:
Botulinum neurotoxin type A2 [1-425]
Synonyms:
BXA2_CLOBJ Botulinum Neurotoxin Type A atx bonT botA
Type:
Metalloprotease
Mol. Mass.:
48687.43
Organism:
Clostridium botulinum
Description:
Recombinant C. botulinum LC/A (1-425) was expressed in E. coli.
Residue:
425
  
Inhibitor
Name:
BDBM23288
Synonyms:
(2E)-3-(2-amino-4-chlorophenyl)-N-hydroxyprop-2-enamide | hydroxamate derivative, 5e
Type:
Small organic molecule
Emp. Form.:
C9H9ClN2O2
Mol. Mass.:
212.633
SMILES:
Nc1cc(Cl)ccc1\C=C\C(=O)NO
:
Substrate
Name:
SNAPtide
Synonyms:
Type:
Fluorogenic Substrate
Mol. Mass.:
358.43
Organism:
Description:
Peptide derived from synaptosomes associated protein, SNAP-25. (U.S. Patent #6504006. List Biological Laboratories, Inc., Campbell, CA.).
Residue:
3
NA