Target
Botulinum neurotoxin type A2 [1-425]
Ligand
BDBM23297
Substrate
SNAP-25 substrate peptide
Meas. Tech.
BoNT/A LC Metalloprotease Activity Assay
pH
7.3±n/a
Temperature
295.15±n/a K
IC50
17000±1700 nM
Citation
 Burnett, JCOpsenica, DSriraghavan, KPanchal, RGRuthel, GHermone, ARNguyen, TLKenny, TALane, DJMcGrath, CFSchmidt, JJVennerstrom, JLGussio, RSolaja, BABavari, S A refined pharmacophore identifies potent 4-amino-7-chloroquinoline-based inhibitors of the botulinum neurotoxin serotype A metalloprotease. J Med Chem 50:2127-36 (2007)  
Target
Name:
Botulinum neurotoxin type A2 [1-425]
Synonyms:
BXA2_CLOBJ Botulinum Neurotoxin Type A atx bonT botA
Type:
Metalloprotease
Mol. Mass.:
48687.43
Organism:
Clostridium botulinum
Description:
Recombinant C. botulinum LC/A (1-425) was expressed in E. coli.
Residue:
425
  
Inhibitor
Name:
BDBM23297
Synonyms:
4-amino-7-chloroquinoline (ACQ)-based compound, 2 methyl (4R)-4-[(2S,5S,7S,9R,14R,15R,16S)-5-({2-[(7-chloroquinolin-4-yl)amino]ethyl}amino)-9,16-bis(acetyloxy)-2,15-dimethyltetracyclo[8.7.0.0^{2,7}.0^{11,15}]heptadecan-14-yl]pentanoate
Type:
Small organic molecule
Emp. Form.:
C40H56ClN3O6
Mol. Mass.:
710.342
SMILES:
[H][C@@]12C[C@H](CC[C@]1(C)C1C[C@H](OC(C)=O)[C@]3(C)[C@H](CCC3C1[C@@H](C2)OC(C)=O)[C@H](C)CCC(=O)OC)NCCNc1ccnc2cc(Cl)ccc12
:
Substrate
Name:
SNAP-25 substrate peptide
Synonyms:
Type:
Peptide
Mol. Mass.:
3661.13
Organism:
Description:
The substrate peptide consisted of residues 187-203 of synaptosomes associated protein (SNAP-25).
Residue:
32