Target
Alpha-amylase 1A
Ligand
BDBM23406
Substrate
BDBM23407
Meas. Tech.
In Vitro alpha-Amylase Activity Assay
pH
6±n/a
Temperature
295.15±n/a K
IC50
996±11 nM
Citation
 Lo Piparo, EScheib, HFrei, NWilliamson, GGrigorov, MChou, CJ Flavonoids for controlling starch digestion: structural requirements for inhibiting human alpha-amylase. J Med Chem 51:3555-61 (2008)  
Target
Name:
Alpha-amylase 1A
Synonyms:
1,4-alpha-D-glucan glucanohydrolase 1 AMY1A Alpha-amylase | Salivary alpha-amylase
Type:
Glycosidase
Mol. Mass.:
57770.18
Organism:
Homo sapiens (Human)
Description:
Purchased from Sigma Chemical Co.
Residue:
511
  
Inhibitor
Name:
BDBM23406
Synonyms:
(3R,4R,5S,6R)-5-{[(2R,3R,4R,5S,6R)-5-{[(2R,3R,4S,5S,6R)-3,4-dihydroxy-6-methyl-5-{[(1S,4R,5S,6S)-4,5,6-trihydroxy-3-(hydroxymethyl)cyclohex-2-en-1-yl]amino}oxan-2-yl]oxy}-3,4-dihydroxy-6-(hydroxymethyl)oxan-2-yl]oxy}-6-(hydroxymethyl)oxane-2,3,4-triol US11292789, Acarbose
Type:
Carbohydrate
Emp. Form.:
C25H43NO18
Mol. Mass.:
645.6048
SMILES:
C[C@H]1O[C@H](O[C@@H]2[C@@H](CO)O[C@H](O[C@@H]3[C@@H](CO)OC(O)[C@H](O)[C@H]3O)[C@H](O)[C@H]2O)[C@H](O)[C@@H](O)[C@@H]1N[C@H]1C=C(CO)[C@@H](O)[C@H](O)[C@H]1O
:
Substrate
Name:
BDBM23407
Synonyms:
(2R,3S,4S,5R,6R)-2-(hydroxymethyl)-6-{[(2R,3S,4R,5R,6S)-4,5,6-trihydroxy-2-(hydroxymethyl)oxan-3-yl]oxy}oxane-3,4,5-triol | Potato starch
Type:
Emp. Form.:
C12H22O11
Mol. Mass.:
342.2965
SMILES:
OC[C@H]1O[C@H](O[C@H]2[C@H](O)[C@@H](O)[C@@H](O)O[C@@H]2CO)[C@H](O)[C@@H](O)[C@@H]1O
: