Target
2-amino-3-carboxymuconate-6-semialdehyde decarboxylase
Ligand
BDBM261530
Substrate
Meas. Tech.
ACMSD1 Inhibition Assay
IC50
49.0±n/a nM
Citation
 Pellicciari, RAuwerx, JRaffaelli, N Inhibitors of α-amino-β-carboxymuconic acid semialdehyde decarboxylase US Patent  US9708272 Publication Date 7/18/2017 
Target
Name:
2-amino-3-carboxymuconate-6-semialdehyde decarboxylase
Synonyms:
ACMSD Picolinate carboxylase
Type:
Enzyme Catalytic Domain
Mol. Mass.:
38037.38
Organism:
Homo sapiens (Human)
Description:
Q8TDX5
Residue:
336
  
Inhibitor
Name:
BDBM261530
Synonyms:
US10513499, Compound 5 US9708272, 5
Type:
Small organic molecule
Emp. Form.:
C16H10N4O3S2
Mol. Mass.:
370.406
SMILES:
OC(=O)c1cccc(CSc2nc(-c3nccs3)c(C#N)c(=O)[nH]2)c1
: