Target
2-amino-3-carboxymuconate-6-semialdehyde decarboxylase
Ligand
BDBM261540
Substrate
Meas. Tech.
ACMSD1 Inhibition Assay
IC50
82.0±n/a nM
Citation
 Pellicciari, RAuwerx, JRaffaelli, N Inhibitors of α-amino-β-carboxymuconic acid semialdehyde decarboxylase US Patent  US9708272 Publication Date 7/18/2017 
Target
Name:
2-amino-3-carboxymuconate-6-semialdehyde decarboxylase
Synonyms:
ACMSD Picolinate carboxylase
Type:
Enzyme Catalytic Domain
Mol. Mass.:
38037.38
Organism:
Homo sapiens (Human)
Description:
Q8TDX5
Residue:
336
  
Inhibitor
Name:
BDBM261540
Synonyms:
US10513499, Compound 8 US9708272, 8
Type:
Small organic molecule
Emp. Form.:
C19H12ClN3O3S
Mol. Mass.:
397.835
SMILES:
OC(=O)c1ccc(CSc2nc(-c3ccc(Cl)cc3)c(C#N)c(=O)[nH]2)cc1
: