Target
Chymotrypsin-C
Ligand
BDBM23709
Substrate
BDBM23729
Meas. Tech.
Human Neutrophil Elastase Inhibition Assay
IC50
50±n/a nM
Citation
 Schepetkin, IAKhlebnikov, AIQuinn, MT N-benzoylpyrazoles are novel small-molecule inhibitors of human neutrophil elastase. J Med Chem 50:4928-38 (2007)  
Target
Name:
Chymotrypsin-C
Synonyms:
CLCR CTRC_HUMAN Chymotrypsin Chymotrypsin-C
Type:
Enzyme
Mol. Mass.:
29487.98
Organism:
Homo sapiens (Human)
Description:
Q99895
Residue:
268
  
Inhibitor
Name:
BDBM23709
Synonyms:
3-methyl-1-[(3,4,5-trimethoxyphenyl)carbonyl]-1H-pyrazole | N-Benzoylpyrazole deriv., 17
Type:
Small organic molecule
Emp. Form.:
C14H16N2O4
Mol. Mass.:
276.2878
SMILES:
COc1cc(cc(OC)c1OC)C(=O)n1ccc(C)n1
:
Substrate
Name:
BDBM23729
Synonyms:
Suc-Ala-Ala-Pro-Phe-7-amino-4-methylcoumarin
Type:
Emp. Form.:
Mol. Mass.:
SMILES:
: