Target
Serine/threonine-protein kinase TBK1
Ligand
BDBM276868
Substrate
Meas. Tech.
Biological Assay for TBK1 and IKKepsilon
IC50
1.28±n/a nM
Citation
 Du, ZGuerrero, JAKaplan, JAKnox, Jr., JENaduthambi, DPhillips, BWVenkataramani, CWang, PWatkins, WJZablocki, J Tank-binding kinase inhibitor compounds US Patent  US10259811 Publication Date 4/16/2019 
Target
Name:
Serine/threonine-protein kinase TBK1
Synonyms:
NAK Protein cereblon/Serine/threonine-protein kinase TBK1 TANK-binding kinase 1 (TBK-1) TBK1 | TBK1_HUMAN
Type:
protein
Mol. Mass.:
83645.20
Organism:
Homo sapiens (Human)
Description:
Q9UHD2
Residue:
729
  
Inhibitor
Name:
BDBM276868
Synonyms:
US10072001, Example 54 | US10259811, Example 54
Type:
Small organic molecule
Emp. Form.:
C29H29N5O2
Mol. Mass.:
479.5729
SMILES:
N#Cc1cc(ccc1OC1CCOCC1)-c1ccnc2[nH]c(cc12)-c1ccc(cc1)N1CCNCC1
: