Target
Inhibitor of nuclear factor kappa-B kinase subunit epsilon
Ligand
BDBM377099
Substrate
Meas. Tech.
Biological Assay for TBK1 and IKKepsilon
IC50
1.08±n/a nM
Citation
 Du, ZGuerrero, JAKaplan, JAKnox, Jr., JENaduthambi, DPhillips, BWVenkataramani, CWang, PWatkins, WJZablocki, J Tank-binding kinase inhibitor compounds US Patent  US10259811 Publication Date 4/16/2019 
Target
Name:
Inhibitor of nuclear factor kappa-B kinase subunit epsilon
Synonyms:
I kappa-B kinase epsilon I-kappa-B kinase epsilon (IKK-E) IKBKE IKK-epsilon IKKE IKKI KIAA0151 | von Hippel-Lindau disease tumor suppressor/Inhibitor of nuclear factor kappa-B kinase subunit epsilon
Type:
Serine/threonine-protein kinase
Mol. Mass.:
80475.98
Organism:
Homo sapiens (Human)
Description:
Kinase inhibitory activity was determined using recombinant human IKK-epsilon expressed in baculovirus as a FLAG-tagged fusion protein.
Residue:
716
  
Inhibitor
Name:
BDBM377099
Synonyms:
US10259811, Example 212
Type:
Small organic molecule
Emp. Form.:
C28H25N7O2
Mol. Mass.:
491.5438
SMILES:
C[N]1=CC=[N](C=C1)c1ccc(cc1)-c1nc2c(ncnc2[nH]1)-c1ccc(OC2CCOCC2)c(c1)C#N
: