Target
Serine/threonine-protein kinase TBK1
Ligand
BDBM276967
Substrate
Meas. Tech.
Biological Assay for TBK1 and IKKepsilon
IC50
1.02±n/a nM
Citation
 Du, ZGuerrero, JAKaplan, JAKnox, Jr., JENaduthambi, DPhillips, BWVenkataramani, CWang, PWatkins, WJZablocki, J Tank-binding kinase inhibitor compounds US Patent  US10259811 Publication Date 4/16/2019 
Target
Name:
Serine/threonine-protein kinase TBK1
Synonyms:
NAK Protein cereblon/Serine/threonine-protein kinase TBK1 TANK-binding kinase 1 (TBK-1) TBK1 | TBK1_HUMAN
Type:
protein
Mol. Mass.:
83645.20
Organism:
Homo sapiens (Human)
Description:
Q9UHD2
Residue:
729
  
Inhibitor
Name:
BDBM276967
Synonyms:
US10072001, Example 143 | US10259811, Example 143
Type:
Small organic molecule
Emp. Form.:
C32H34N6O4
Mol. Mass.:
566.6502
SMILES:
COc1cc(ccc1N1CCN(CC1)C1COC1)-c1cc2c(ncnc2[nH]1)-c1ccc(OC2CCOCC2)c(c1)C#N
: