Target
Inhibitor of nuclear factor kappa-B kinase subunit epsilon
Ligand
BDBM276999
Substrate
Meas. Tech.
Biological Assay for TBK1 and IKKepsilon
IC50
1.44±n/a nM
Citation
 Du, ZGuerrero, JAKaplan, JAKnox, Jr., JENaduthambi, DPhillips, BWVenkataramani, CWang, PWatkins, WJZablocki, J Tank-binding kinase inhibitor compounds US Patent  US10259811 Publication Date 4/16/2019 
Target
Name:
Inhibitor of nuclear factor kappa-B kinase subunit epsilon
Synonyms:
I kappa-B kinase epsilon I-kappa-B kinase epsilon (IKK-E) IKBKE IKK-epsilon IKKE IKKI KIAA0151 | von Hippel-Lindau disease tumor suppressor/Inhibitor of nuclear factor kappa-B kinase subunit epsilon
Type:
Serine/threonine-protein kinase
Mol. Mass.:
80475.98
Organism:
Homo sapiens (Human)
Description:
Kinase inhibitory activity was determined using recombinant human IKK-epsilon expressed in baculovirus as a FLAG-tagged fusion protein.
Residue:
716
  
Inhibitor
Name:
BDBM276999
Synonyms:
US10072001, Example 176 | US10259811, Example 176
Type:
Small organic molecule
Emp. Form.:
C33H33F2N7O4
Mol. Mass.:
629.6564
SMILES:
OCC(=O)N1CCC(Oc2cnc(cc2C#N)-c2ccnc3[nH]c(cc23)-c2ccc(cc2)N2CCN(CC2)C2COC2)C(F)(F)C1
: