Target
Inhibitor of nuclear factor kappa-B kinase subunit epsilon
Ligand
BDBM277029
Substrate
Meas. Tech.
Biological Assay for TBK1 and IKKepsilon
IC50
1.48±n/a nM
Citation
 Du, ZGuerrero, JAKaplan, JAKnox, Jr., JENaduthambi, DPhillips, BWVenkataramani, CWang, PWatkins, WJZablocki, J Tank-binding kinase inhibitor compounds US Patent  US10259811 Publication Date 4/16/2019 
Target
Name:
Inhibitor of nuclear factor kappa-B kinase subunit epsilon
Synonyms:
I kappa-B kinase epsilon I-kappa-B kinase epsilon (IKK-E) IKBKE IKK-epsilon IKKE IKKI KIAA0151 | von Hippel-Lindau disease tumor suppressor/Inhibitor of nuclear factor kappa-B kinase subunit epsilon
Type:
Serine/threonine-protein kinase
Mol. Mass.:
80475.98
Organism:
Homo sapiens (Human)
Description:
Kinase inhibitory activity was determined using recombinant human IKK-epsilon expressed in baculovirus as a FLAG-tagged fusion protein.
Residue:
716
  
Inhibitor
Name:
BDBM277029
Synonyms:
US10072001, Example 220 | US10259811, Example 220
Type:
Small organic molecule
Emp. Form.:
C30H30N6O4
Mol. Mass.:
538.597
SMILES:
OCC(=O)N1CCC(CC1)Oc1ccc(cc1C#N)-c1ncnc2[nH]c(cc12)-c1ccc(cc1)N1CCOCC1
: