Target
Serine/threonine-protein kinase TBK1
Ligand
BDBM277034
Substrate
Meas. Tech.
Biological Assay for TBK1 and IKKepsilon
IC50
1.24±n/a nM
Citation
 Du, ZGuerrero, JAKaplan, JAKnox, Jr., JENaduthambi, DPhillips, BWVenkataramani, CWang, PWatkins, WJZablocki, J Tank-binding kinase inhibitor compounds US Patent  US10259811 Publication Date 4/16/2019 
Target
Name:
Serine/threonine-protein kinase TBK1
Synonyms:
NAK Protein cereblon/Serine/threonine-protein kinase TBK1 TANK-binding kinase 1 (TBK-1) TBK1 | TBK1_HUMAN
Type:
protein
Mol. Mass.:
83645.20
Organism:
Homo sapiens (Human)
Description:
Q9UHD2
Residue:
729
  
Inhibitor
Name:
BDBM277034
Synonyms:
US10072001, Example 226 | US10259811, Example 226
Type:
Small organic molecule
Emp. Form.:
C30H31N5O3
Mol. Mass.:
509.5988
SMILES:
N#Cc1cc(ccc1OC1CCOCC1)-c1ncnc2[nH]c(cc12)-c1ccc(OCCN2CCCC2)cc1
: