Target
Serine/threonine-protein kinase TBK1
Ligand
BDBM277063
Substrate
Meas. Tech.
Biological Assay for TBK1 and IKKepsilon
IC50
1.53±n/a nM
Citation
 Du, ZGuerrero, JAKaplan, JAKnox, Jr., JENaduthambi, DPhillips, BWVenkataramani, CWang, PWatkins, WJZablocki, J Tank-binding kinase inhibitor compounds US Patent  US10259811 Publication Date 4/16/2019 
Target
Name:
Serine/threonine-protein kinase TBK1
Synonyms:
NAK Protein cereblon/Serine/threonine-protein kinase TBK1 TANK-binding kinase 1 (TBK-1) TBK1 | TBK1_HUMAN
Type:
protein
Mol. Mass.:
83645.20
Organism:
Homo sapiens (Human)
Description:
Q9UHD2
Residue:
729
  
Inhibitor
Name:
BDBM277063
Synonyms:
US10072001, Example 255 | US10259811, Example 255
Type:
Small organic molecule
Emp. Form.:
C32H33F2N7O3
Mol. Mass.:
601.6463
SMILES:
OCC(=O)N1CCC(CC1)Oc1ccc(cc1C#N)-c1ncnc2[nH]c(nc12)-c1ccc(cc1)C1CCN(CC(F)F)CC1
: