Target
Serine/threonine-protein kinase pim-1
Ligand
BDBM377212
Substrate
Meas. Tech.
Pim Enzyme Assays
IC50
<100±n/a nM
Citation
 Xue, CFeng, HLi, YZhang, K Thiazolecarboxamides and pyridinecarboxamide compounds useful as Pim kinase inhibitors US Patent  US10265307 Publication Date 4/23/2019 
Target
Name:
Serine/threonine-protein kinase pim-1
Synonyms:
PIM-1 Kinase PIM1_HUMAN Serine/threonine-protein kinase (PIM1) Serine/threonine-protein kinase PIM1 | Serine/threonine-protein kinase pim-1 (PIM1)
Type:
Protein
Mol. Mass.:
35681.82
Organism:
Homo sapiens (Human)
Description:
P11309
Residue:
313
  
Inhibitor
Name:
BDBM377212
Synonyms:
US10265307, Example 53-2 US10828290, Example 53 (Diastereoisomer 2)
Type:
Small organic molecule
Emp. Form.:
C24H26F2N6O3S
Mol. Mass.:
516.563
SMILES:
COc1ccc(F)c(-c2nc(C(=O)Nc3cnc4[C@H](O)CCc4c3N3CCC[C@H](N)C3)c(N)s2)c1F
: