Target
Botulinum neurotoxin type A2 [1-425]
Ligand
BDBM24726
Substrate
SNAP-25 substrate peptide
Meas. Tech.
BoNT/A LC Metalloprotease Activity Assay
pH
7.3±n/a
Temperature
310.15±n/a K
IC50
50100±2800 nM
Citation
 Solaja, BAOpsenica, DSmith, KSMilhous, WKTerzić, NOpsenica, IBurnett, JCNuss, JGussio, RBavari, S Novel 4-aminoquinolines active against chloroquine-resistant and sensitive P. falciparum strains that also inhibit botulinum serotype A. J Med Chem 51:4388-91 (2008)  
Target
Name:
Botulinum neurotoxin type A2 [1-425]
Synonyms:
BXA2_CLOBJ Botulinum Neurotoxin Type A atx bonT botA
Type:
Metalloprotease
Mol. Mass.:
48687.43
Organism:
Clostridium botulinum
Description:
Recombinant C. botulinum LC/A (1-425) was expressed in E. coli.
Residue:
425
  
Inhibitor
Name:
BDBM24726
Synonyms:
4-Aminoquinoline, 18 | [2-(adamantan-1-yl)ethyl]({3-[(7-chloroquinolin-4-yl)amino]propyl})amine
Type:
Small organic molecule
Emp. Form.:
C24H32ClN3
Mol. Mass.:
397.984
SMILES:
Clc1ccc2c(NCCCNCCC34CC5CC(CC(C5)C3)C4)ccnc2c1
:
Substrate
Name:
SNAP-25 substrate peptide
Synonyms:
Type:
Peptide
Mol. Mass.:
1978.24
Organism:
Description:
It is an N-terminal acetylated, C-terminal aminated, synthetic peptide identical in sequence to residues 187-203 of SNAP-25.
Residue:
17
SNKTRIDEANQRATKML