Target
Serine/threonine-protein kinase PLK2
Ligand
BDBM24935
Substrate
CHK2 Substrate Peptide
Meas. Tech.
Plk in Vitro Assay
pH
7.2±n/a
Temperature
303.15±n/a K
IC50
172±n/a nM
Citation
 Hanan, EJFucini, RVRomanowski, MJElling, RALew, WPurkey, HEVanderPorten, ECYang, W Design and synthesis of 2-amino-isoxazolopyridines as Polo-like kinase inhibitors. Bioorg Med Chem Lett 18:5186-9 (2008)  
Target
Name:
Serine/threonine-protein kinase PLK2
Synonyms:
PLK2 Polo-Like Kinase 2 Serine/threonine-protein kinase PLK2 Serum-inducible kinase
Type:
Serine/threonine-protein kinase
Mol. Mass.:
78259.87
Organism:
Homo sapiens (Human)
Description:
Full-length human PLK2 was expressed as GST-fusion protein using baculovirus expression system. GST-PLK2 was purified by using glutathione sepharose chromatography.
Residue:
685
  
Inhibitor
Name:
BDBM24935
Synonyms:
2-amino-isoxazolopyridine, 15 | 3-[3-chloro-5-(5-{[(1S)-1-phenylethyl]amino}pyrido[4,3-d][1,2]oxazol-3-yl)phenyl]propanamide
Type:
Small organic molecule
Emp. Form.:
C23H21ClN4O2
Mol. Mass.:
420.891
SMILES:
C[C@H](Nc1cc2c(noc2cn1)-c1cc(Cl)cc(CCC(N)=O)c1)c1ccccc1
:
Substrate
Name:
CHK2 Substrate Peptide
Synonyms:
CHK2tide
Type:
Fluorophore tagged peptide
Mol. Mass.:
1755.03
Organism:
Description:
Residue:
14
AMRLERQDSIFYPK