Target
Serine/threonine-protein kinase PLK2
Ligand
BDBM25113
Substrate
Biotinylated PLKtide
Meas. Tech.
PLK Kinase Assay
pH
7.5±n/a
Temperature
295.15±n/a K
Ki
>20000±n/a nM
Km
2000±n/a nM
Citation
 Johnson, EFStewart, KDWoods, KWGiranda, VLLuo, Y Pharmacological and functional comparison of the polo-like kinase family: insight into inhibitor and substrate specificity. Biochemistry 46:9551-63 (2007)  
Target
Name:
Serine/threonine-protein kinase PLK2
Synonyms:
PLK2 Polo-Like Kinase 2 Serine/threonine-protein kinase PLK2 Serum-inducible kinase
Type:
Serine/threonine-protein kinase
Mol. Mass.:
78259.87
Organism:
Homo sapiens (Human)
Description:
Full-length human PLK2 was expressed as GST-fusion protein using baculovirus expression system. GST-PLK2 was purified by using glutathione sepharose chromatography.
Residue:
685
  
Inhibitor
Name:
BDBM25113
Synonyms:
5-(4-aminophenyl)thieno[2,3-d]pyrimidin-4-amine | thienopyrimidine analogue, 1
Type:
Small organic molecule
Emp. Form.:
C12H10N4S
Mol. Mass.:
242.3
SMILES:
Nc1ccc(cc1)-c1csc2ncnc(N)c12
:
Substrate
Name:
Biotinylated PLKtide
Synonyms:
Type:
Peptide
Mol. Mass.:
1447.52
Organism:
Description:
Residue:
13
EVIEASFAEQEAK