Target
Serine/threonine-protein kinase PLK2
Ligand
BDBM16919
Substrate
Biotinylated PLKtide
Meas. Tech.
PLK Kinase Assay
Ki
980±n/a nM
Citation
 Johnson, EFStewart, KDWoods, KWGiranda, VLLuo, Y Pharmacological and functional comparison of the polo-like kinase family: insight into inhibitor and substrate specificity. Biochemistry 46:9551-63 (2007)  
Target
Name:
Serine/threonine-protein kinase PLK2
Synonyms:
PLK2 Polo-Like Kinase 2 Serine/threonine-protein kinase PLK2 Serum-inducible kinase
Type:
Serine/threonine-protein kinase
Mol. Mass.:
78259.87
Organism:
Homo sapiens (Human)
Description:
Full-length human PLK2 was expressed as GST-fusion protein using baculovirus expression system. GST-PLK2 was purified by using glutathione sepharose chromatography.
Residue:
685
  
Inhibitor
Name:
BDBM16919
Synonyms:
3-[(2S)-2-amino-3-[(5-{thieno[2,3-c]pyridin-2-yl}pyridin-3-yl)oxy]propyl]-1H-indole CHEMBL516429 | thieno[2,3-c]pyridine, 9a
Type:
Small organic molecule
Emp. Form.:
C23H20N4OS
Mol. Mass.:
400.496
SMILES:
N[C@H](COc1cncc(c1)-c1cc2ccncc2s1)Cc1c[nH]c2ccccc12
:
Substrate
Name:
Biotinylated PLKtide
Synonyms:
Type:
Peptide
Mol. Mass.:
1447.52
Organism:
Description:
Residue:
13
EVIEASFAEQEAK