Target
Serine/threonine-protein kinase PLK2
Ligand
BDBM25119
Substrate
Biotinylated PLKtide
Meas. Tech.
PLK Kinase Assay
Ki
140±n/a nM
Citation
 Johnson, EFStewart, KDWoods, KWGiranda, VLLuo, Y Pharmacological and functional comparison of the polo-like kinase family: insight into inhibitor and substrate specificity. Biochemistry 46:9551-63 (2007)  
Target
Name:
Serine/threonine-protein kinase PLK2
Synonyms:
PLK2 Polo-Like Kinase 2 Serine/threonine-protein kinase PLK2 Serum-inducible kinase
Type:
Serine/threonine-protein kinase
Mol. Mass.:
78259.87
Organism:
Homo sapiens (Human)
Description:
Full-length human PLK2 was expressed as GST-fusion protein using baculovirus expression system. GST-PLK2 was purified by using glutathione sepharose chromatography.
Residue:
685
  
Inhibitor
Name:
BDBM25119
Synonyms:
(3E)-5-(5-{[(2S)-2-amino-3-(1H-indol-3-yl)propyl]oxy}pyridin-3-yl)-3-(furan-2-ylmethylidene)-1,3-dihydro-2H-indol-2-one dihydroindol-2-one, 13
Type:
Small organic molecule
Emp. Form.:
C29H24N4O3
Mol. Mass.:
476.5259
SMILES:
N[C@H](COc1cncc(c1)-c1ccc2NC(=O)\C(=C\c3ccco3)c2c1)Cc1c[nH]c2ccccc12
:
Substrate
Name:
Biotinylated PLKtide
Synonyms:
Type:
Peptide
Mol. Mass.:
1447.52
Organism:
Description:
Residue:
13
EVIEASFAEQEAK