Target
Calpain-1 catalytic subunit
Ligand
BDBM25888
Substrate
BODIPY FL casein
Meas. Tech.
BODIPY Fluorescent Microplate Assay
pH
7.5±n/a
Temperature
298.15±n/a K
IC50
650±n/a nM
Citation
 Jones, MAMorton, JDCoxon, JMMcNabb, SBLee, HYAitken, SGMehrtens, JMRobertson, LJNeffe, ATMiyamoto, SBickerstaffe, RGately, KWood, JMAbell, AD Synthesis, biological evaluation and molecular modelling of N-heterocyclic dipeptide aldehydes as selective calpain inhibitors. Bioorg Med Chem 16:6911-23 (2008)  
Target
Name:
Calpain-1 catalytic subunit
Synonyms:
Calpain I 80 kDa subunit o-CAPN1
Type:
Enzyme
Mol. Mass.:
82073.19
Organism:
Ovis aries (sheep)
Description:
B2ZA85
Residue:
716
  
Inhibitor
Name:
BDBM25888
Synonyms:
(2S)-3-methyl-N-[(2S)-4-methyl-1-oxopentan-2-yl]-2-(1H-pyrrol-2-ylformamido)butanamide | N-heterocyclic dipeptide aldehyde, 6
Type:
Small organic molecule
Emp. Form.:
C16H25N3O3
Mol. Mass.:
307.388
SMILES:
CC(C)C[C@H](NC(=O)[C@@H](NC(=O)c1ccc[nH]1)C(C)C)C=O
:
Substrate
Name:
BODIPY FL casein
Synonyms:
4,4-difluoro-5,7-dimethyl-4-bora-3a,4adiaza-s-indacene-3-propionic acid (BODIPY-FL) labeled casein
Type:
fluorescent dye-labeled substrate
Mol. Mass.:
358.43
Organism:
Description:
Residue:
3
NA