Target
Calpain-1 catalytic subunit
Ligand
BDBM25893
Substrate
BODIPY FL casein
Meas. Tech.
BODIPY Fluorescent Microplate Assay
pH
7.5±n/a
Temperature
298.15±n/a K
IC50
150±n/a nM
Citation
 Jones, MAMorton, JDCoxon, JMMcNabb, SBLee, HYAitken, SGMehrtens, JMRobertson, LJNeffe, ATMiyamoto, SBickerstaffe, RGately, KWood, JMAbell, AD Synthesis, biological evaluation and molecular modelling of N-heterocyclic dipeptide aldehydes as selective calpain inhibitors. Bioorg Med Chem 16:6911-23 (2008)  
Target
Name:
Calpain-1 catalytic subunit
Synonyms:
Calpain I 80 kDa subunit o-CAPN1
Type:
Enzyme
Mol. Mass.:
82073.19
Organism:
Ovis aries (sheep)
Description:
B2ZA85
Residue:
716
  
Inhibitor
Name:
BDBM25893
Synonyms:
(2S)-2-[(5-formyl-1-methyl-1H-pyrrol-2-yl)formamido]-3-methyl-N-[(2S)-4-methyl-1-oxopentan-2-yl]butanamide | N-heterocyclic dipeptide aldehyde, 11
Type:
Small organic molecule
Emp. Form.:
C18H27N3O4
Mol. Mass.:
349.4247
SMILES:
CC(C)C[C@H](NC(=O)[C@@H](NC(=O)c1ccc(C=O)n1C)C(C)C)C=O
:
Substrate
Name:
BODIPY FL casein
Synonyms:
4,4-difluoro-5,7-dimethyl-4-bora-3a,4adiaza-s-indacene-3-propionic acid (BODIPY-FL) labeled casein
Type:
fluorescent dye-labeled substrate
Mol. Mass.:
358.43
Organism:
Description:
Residue:
3
NA