Target
Calpain-2 catalytic subunit
Ligand
BDBM25886
Substrate
BODIPY FL casein
Meas. Tech.
BODIPY Fluorescent Microplate Assay
pH
7.5±n/a
Temperature
298.15±n/a K
IC50
135±n/a nM
Citation
 Jones, MAMorton, JDCoxon, JMMcNabb, SBLee, HYAitken, SGMehrtens, JMRobertson, LJNeffe, ATMiyamoto, SBickerstaffe, RGately, KWood, JMAbell, AD Synthesis, biological evaluation and molecular modelling of N-heterocyclic dipeptide aldehydes as selective calpain inhibitors. Bioorg Med Chem 16:6911-23 (2008)  
Target
Name:
Calpain-2 catalytic subunit
Synonyms:
Calpain II 80 kDa subunit o-CAPN2
Type:
Enzyme
Mol. Mass.:
79914.19
Organism:
Ovis aries (sheep)
Description:
A8IF71
Residue:
700
  
Inhibitor
Name:
BDBM25886
Synonyms:
(2S)-2-(furan-2-ylformamido)-3-methyl-N-[(2S)-4-methyl-1-oxopentan-2-yl]butanamide | N-heterocyclic dipeptide aldehyde, 4
Type:
Small organic molecule
Emp. Form.:
C16H24N2O4
Mol. Mass.:
308.3728
SMILES:
CC(C)C[C@H](NC(=O)[C@@H](NC(=O)c1ccco1)C(C)C)C=O
:
Substrate
Name:
BODIPY FL casein
Synonyms:
4,4-difluoro-5,7-dimethyl-4-bora-3a,4adiaza-s-indacene-3-propionic acid (BODIPY-FL) labeled casein
Type:
fluorescent dye-labeled substrate
Mol. Mass.:
358.43
Organism:
Description:
Residue:
3
NA