Target
Carbonic anhydrase 5A, mitochondrial
Ligand
BDBM26190
Substrate
BDBM10856
Meas. Tech.
CA Inhibition Assay
Ki
14100±n/a nM
Citation
 Innocenti, AVullo, DScozzafava, ASupuran, CT Carbonic anhydrase inhibitors: inhibition of mammalian isoforms I-XIV with a series of substituted phenols including paracetamol and salicylic acid. Bioorg Med Chem 16:7424-8 (2008)  
Target
Name:
Carbonic anhydrase 5A, mitochondrial
Synonyms:
CA-VA CA5A Carbonate dehydratase VA Carbonic anhydrase 5A (CA VA) Carbonic anhydrase 5A, mitochondrial precursor Carbonic anhydrase VA (CA VA)
Type:
Enzyme
Mol. Mass.:
34755.54
Organism:
Homo sapiens (Human)
Description:
Human (cloned) isozyme
Residue:
305
  
Inhibitor
Name:
BDBM26190
Synonyms:
1,4-Dihydroxybenzene, XIII CHEMBL537 Hydroquinone, HQ phenol derivative, 4
Type:
Small organic molecule
Emp. Form.:
C6H6O2
Mol. Mass.:
110.1106
SMILES:
Oc1ccc(O)cc1
:
Substrate
Name:
BDBM10856
Synonyms:
Carbon Dioxide | methanedione
Type:
Small organic molecule
Emp. Form.:
CO2
Mol. Mass.:
44.0095
SMILES:
O=C=O
: