Target
Baculoviral IAP repeat-containing protein 3 [238-349]
Ligand
BDBM26209
Substrate
Smac-derived peptide
Meas. Tech.
Fluorescence Polarization Assay
pH
7.5±n/a
Temperature
295.15±n/a K
Ki
20±10 nM
Citation
 Zhang, BNikolovska-Coleska, ZZhang, YBai, LQiu, SYang, CYSun, HWang, SWu, Y Design, Synthesis, and Evaluation of Tricyclic, Conformationally Constrained Small-Molecule Mimetics of Second Mitochondria-Derived Activator of Caspases. J Med Chem 51:7352-5 (2008)  
Target
Name:
Baculoviral IAP repeat-containing protein 3 [238-349]
Synonyms:
API2 BIRC3 Baculoviral IAP repeat-containing protein 3 Inhibitor of apoptosis protein 1 RNF49 cIAP-2 BIR3
Type:
BIR3 domain
Mol. Mass.:
12945.93
Organism:
Homo sapiens (Human)
Description:
Human cIAP2 BIR3 domain (residues 238-349) was used in binding assays.
Residue:
112
  
Inhibitor
Name:
BDBM26209
Synonyms:
(2R,6S,9S)-N-(diphenylmethyl)-9-[(2S)-2-(methylamino)propanamido]-8-oxo-7-azatricyclo[9.4.0.0^{2,7}]pentadeca-1(15),11,13-triene-6-carboxamide | Smac mimetic, 8
Type:
Small organic molecule
Emp. Form.:
C32H36N4O3
Mol. Mass.:
524.6532
SMILES:
CN[C@@H](C)C(=O)N[C@H]1Cc2ccccc2[C@H]2CCC[C@H](N2C1=O)C(=O)NC(c1ccccc1)c1ccccc1
:
Substrate
Name:
Smac-derived peptide
Synonyms:
SM5F
Type:
fluorescently labelled peptide
Mol. Mass.:
1220.95
Organism:
Description:
5-carboxyfluorescein was coupled to the lysine side chain of the mutated Smac peptide.
Residue:
10
ARPFKFAMNH