Target
Serine/threonine-protein kinase PLK2
Ligand
BDBM25121
Substrate
Ser/Thr 16 Peptide
Meas. Tech.
Enzymatic Activity Assay
pH
7.5±n/a
Temperature
295.15±n/a K
IC50
16.8±7.4 nM
Citation
 Kothe, MKohls, DLow, SColi, RRennie, GRFeru, FKuhn, CDing, YH Selectivity-determining residues in Plk1. Chem Biol Drug Des 70:540-6 (2007)  
Target
Name:
Serine/threonine-protein kinase PLK2
Synonyms:
PLK2 Polo-Like Kinase 2 Serine/threonine-protein kinase PLK2 Serum-inducible kinase
Type:
Serine/threonine-protein kinase
Mol. Mass.:
78259.87
Organism:
Homo sapiens (Human)
Description:
Full-length human PLK2 was expressed as GST-fusion protein using baculovirus expression system. GST-PLK2 was purified by using glutathione sepharose chromatography.
Residue:
685
  
Inhibitor
Name:
BDBM25121
Synonyms:
4-{[(7R)-8-cyclopentyl-7-ethyl-5-methyl-6-oxo-5,6,7,8-tetrahydropteridin-2-yl]amino}-3-methoxy-N-(1-methylpiperidin-4-yl)benzamide CHEMBL513909 US8598172, 5
Type:
Small organic molecule
Emp. Form.:
C28H39N7O3
Mol. Mass.:
521.6544
SMILES:
CC[C@H]1N(C2CCCC2)c2nc(Nc3ccc(cc3OC)C(=O)NC3CCN(C)CC3)ncc2N(C)C1=O
:
Substrate
Name:
Ser/Thr 16 Peptide
Synonyms:
Type:
Peptide
Mol. Mass.:
358.43
Organism:
Description:
SelectScreen Biochemical Kinase Profiling Service (Invitrogen Corporation, Carlsbad, CA, USA).
Residue:
3
NA