Target
Serine/threonine-protein kinase PLK2
Ligand
BDBM26516
Substrate
Ser/Thr 16 Peptide
Meas. Tech.
Enzymatic Activity Assay
pH
7.5±n/a
Temperature
295.15±n/a K
IC50
367.3±41.5 nM
Citation
 Kothe, MKohls, DLow, SColi, RRennie, GRFeru, FKuhn, CDing, YH Selectivity-determining residues in Plk1. Chem Biol Drug Des 70:540-6 (2007)  
Target
Name:
Serine/threonine-protein kinase PLK2
Synonyms:
PLK2 Polo-Like Kinase 2 Serine/threonine-protein kinase PLK2 Serum-inducible kinase
Type:
Serine/threonine-protein kinase
Mol. Mass.:
78259.87
Organism:
Homo sapiens (Human)
Description:
Full-length human PLK2 was expressed as GST-fusion protein using baculovirus expression system. GST-PLK2 was purified by using glutathione sepharose chromatography.
Residue:
685
  
Inhibitor
Name:
BDBM26516
Synonyms:
1-[4-(cyclopentylamino)-2-{[4-(4-methylpiperazin-1-yl)phenyl]amino}pyrimidin-5-yl]ethan-1-one | BI 2536 analogue, 2b
Type:
Small organic molecule
Emp. Form.:
C22H30N6O
Mol. Mass.:
394.5132
SMILES:
CN1CCN(CC1)c1ccc(Nc2ncc(C(C)=O)c(NC3CCCC3)n2)cc1
:
Substrate
Name:
Ser/Thr 16 Peptide
Synonyms:
Type:
Peptide
Mol. Mass.:
358.43
Organism:
Description:
SelectScreen Biochemical Kinase Profiling Service (Invitrogen Corporation, Carlsbad, CA, USA).
Residue:
3
NA