Target
DNA-(apurinic or apyrimidinic site) endonuclease
Ligand
BDBM26613
Substrate
DNA Substrate
Meas. Tech.
High-Throughput Screening and IC50 Determinations
pH
7.5±n/a
Temperature
295.15±n/a K
IC50
200±100 nM
Comments
98% Inhibition uM.
Citation
 Seiple, LACardellina, JHAkee, RStivers, JT Potent inhibition of human apurinic/apyrimidinic endonuclease 1 by arylstibonic acids. Mol Pharmacol 73:669-77 (2008)  
Target
Name:
DNA-(apurinic or apyrimidinic site) endonuclease
Synonyms:
APE APEX APEX1_HUMAN Apurinic-apyrimidinic endonuclease 1 (APE-1) DNA-(apurinic or apyrimidinic site) lyase REF1
Type:
Protein
Mol. Mass.:
35560.12
Organism:
Homo sapiens (Human)
Description:
P27695
Residue:
318
  
Inhibitor
Name:
BDBM26613
Synonyms:
(2E)-3-{3-[dihydroxy(oxo)--stibanyl]phenyl}prop-2-enoic acid | Compound 13778
Type:
Small organic molecule
Emp. Form.:
C9H9O5Sb
Mol. Mass.:
318.92
SMILES:
OC(=O)\C=C\c1cccc(c1)[Sb](O)(O)=O
:
Substrate
Name:
DNA Substrate
Synonyms:
Annealed double-stranded oligonucleotide with an abasic site.
Type:
Fluorescent substrate
Mol. Mass.:
1563.78
Organism:
Description:
The top strand is 5-FAM-GAG AA(F) ATA GTC GCG-3 containing the tetrahydrofuran synthetic abasic residue (F).
Residue:
18
FAMGAGAAFATAGTCGCG