Target
DNA-(apurinic or apyrimidinic site) endonuclease
Ligand
BDBM26622
Substrate
DNA Substrate
Meas. Tech.
High-Throughput Screening and IC50 Determinations
pH
7.5±n/a
Temperature
295.15±n/a K
Ki
36±10 nM
IC50
17±2 nM
Citation
 Seiple, LACardellina, JHAkee, RStivers, JT Potent inhibition of human apurinic/apyrimidinic endonuclease 1 by arylstibonic acids. Mol Pharmacol 73:669-77 (2008)  
Target
Name:
DNA-(apurinic or apyrimidinic site) endonuclease
Synonyms:
APE APEX APEX1_HUMAN Apurinic-apyrimidinic endonuclease 1 (APE-1) DNA-(apurinic or apyrimidinic site) lyase REF1
Type:
Protein
Mol. Mass.:
35560.12
Organism:
Homo sapiens (Human)
Description:
P27695
Residue:
318
  
Inhibitor
Name:
BDBM26622
Synonyms:
Compound 13793 | ethyl 4-{4-[dihydroxy(oxo)--stibanyl]phenyl}butanoate
Type:
Small organic molecule
Emp. Form.:
C12H17O5Sb
Mol. Mass.:
363.02
SMILES:
CCOC(=O)CCCc1ccc(cc1)[Sb](O)(O)=O
:
Substrate
Name:
DNA Substrate
Synonyms:
Annealed double-stranded oligonucleotide with an abasic site.
Type:
Fluorescent substrate
Mol. Mass.:
1563.78
Organism:
Description:
The top strand is 5-FAM-GAG AA(F) ATA GTC GCG-3 containing the tetrahydrofuran synthetic abasic residue (F).
Residue:
18
FAMGAGAAFATAGTCGCG