Target
Sodium channel protein type 5 subunit alpha
Ligand
BDBM71341
Substrate
Meas. Tech.
Radioligand Binding Assay (EP) (In vitro Assay)
pH
7.4±n/a
Temperature
298.15±n/a K
IC50
1.50±n/a nM
Comments
extracted
Citation
 Andrez, JBichler, PRChen, CChowdhury, SDecker, SMDehnhardt, CMFocken, TGrimwood, MEHemeon, IWJia, QLi, JLiu, ZOrtwine, DFSafina, BSutherlin, DSheng, TSun, SWhite, ADWilson, MSZenova, AYZhu, J Substituted benzamides and methods of use thereof US Patent  US9546164 Publication Date 1/17/2017 
Target
Name:
Sodium channel protein type 5 subunit alpha
Synonyms:
HH1 SCN5A_HUMAN Sodium channel protein type 5 subunit alpha/beta-1/beta-2 Voltage-gated sodium channel subunit alpha Nav1.5
Type:
Enzyme
Mol. Mass.:
226908.60
Organism:
Homo sapiens (Human)
Description:
Q14524
Residue:
2016
  
Inhibitor
Name:
BDBM71341
Synonyms:
US9546164, 412 | US9694002, 412
Type:
Small organic molecule
Emp. Form.:
C30H31Cl2FN2O4S
Mol. Mass.:
605.548
SMILES:
CS(=O)(=O)NC(=O)c1cc(C2CC2)c(OCC2CCN(CC2)C(c2ccccc2)c2cc(Cl)cc(Cl)c2)cc1F
: