Target
A-kinase anchor protein 7 isoform gamma
Ligand
BDBM212738
Substrate
Meas. Tech.
Binding Assay
EC50
22200±n/a nM
Citation
 Tasken, KLygren, BOstensen, EKlaveness, J Tertiary amines for use in the treatment of cardiac disorders US Patent  US9951033 Publication Date 4/24/2018 
Target
Name:
A-kinase anchor protein 7 isoform gamma
Synonyms:
A-kinase anchor protein 18 AKAP-18 Akap18 PRKA7 isoform gamma | Protein kinase A-anchoring protein 7 isoform gamma
Type:
Mol. Mass.:
35486.56
Organism:
Mus musculus (Mouse)
Description:
Q7TN79
Residue:
314
  
Inhibitor
Name:
BDBM212738
Synonyms:
US9556111, Table 1.21 | US9951033, Compound Table 1.20
Type:
Small organic molecule
Emp. Form.:
C21H28N4
Mol. Mass.:
336.4716
SMILES:
[NH3+]c1ccc(C[NH+](Cc2ccc([NH3+])cc2)Cc2ccc([NH3+])cc2)cc1
: