Target
Cannabinoid receptor 1
Ligand
BDBM27340
Substrate
BDBM21278
Meas. Tech.
CB Receptor Binding Assay
pH
7.4±n/a
Temperature
303.15±n/a K
Ki
6.1±5.3 nM
Citation
 Griffith, DAHadcock, JRBlack, SCIredale, PACarpino, PADaSilva-Jardine, PDay, RDiBrino, JDow, RLLandis, MSO'Connor, REScott, DO Discovery of 1-[9-(4-chlorophenyl)-8-(2-chlorophenyl)-9H-purin-6-yl]-4-ethylaminopiperidine-4-carboxylic acid amide hydrochloride (CP-945,598), a novel, potent, and selective cannabinoid type 1 receptor antagonist. J Med Chem 52:234-7 (2009)  
Target
Name:
Cannabinoid receptor 1
Synonyms:
CANN6 CB-R CNR CNR1_HUMAN Cannabinoid receptor Cannabinoid receptor 1 (brain)
Type:
G Protein-Coupled Receptor (GPCR)
Mol. Mass.:
52868.96
Organism:
Homo sapiens (Human)
Description:
P21554
Residue:
472
  
Inhibitor
Name:
BDBM27340
Synonyms:
9-(4-chlorophenyl)-8-(2,4-dichlorophenyl)-6-(piperidin-1-yl)-9H-purine | Purine antagonist, 3d
Type:
Small organic molecule
Emp. Form.:
C22H18Cl3N5
Mol. Mass.:
458.771
SMILES:
Clc1ccc(cc1)-n1c(nc2c(ncnc12)N1CCCCC1)-c1ccc(Cl)cc1Cl
:
Substrate
Name:
BDBM21278
Synonyms:
5-(4-chlorophenyl)-1-(2,4-dichlorophenyl)-4-methyl-N-(piperidin-1-yl)-1H-pyrazole-3-carboxamide CHEMBL111 RIMONABANT HYDROCHLORIDE SR 141716A SR141716A [3H]SR141716A
Type:
Small organic molecule
Emp. Form.:
C22H21Cl3N4O
Mol. Mass.:
463.787
SMILES:
Cc1c(nn(c1-c1ccc(Cl)cc1)-c1ccc(Cl)cc1Cl)C(=O)NN1CCCCC1
: