Target
Gag-Pol polyprotein [588-1027]
Ligand
BDBM27579
Substrate
poly r(A).oligo d(T)16
Meas. Tech.
Reverse Transcriptase Assay
pH
7.8±n/a
Temperature
310.15±n/a K
IC50
47±35 nM
Citation
 Jones, LHAllan, GBarba, OBurt, CCorbau, RDupont, TKnöchel, TIrving, SMiddleton, DSMowbray, CEPerros, MRingrose, HSwain, NAWebster, RWestby, MPhillips, C Novel Indazole Non-Nucleoside Reverse Transcriptase Inhibitors Using Molecular Hybridization Based on Crystallographic Overlays (dagger). J Med Chem 52:1219-23 (2009)  
Target
Name:
Gag-Pol polyprotein [588-1027]
Synonyms:
HIV-1 Reverse Transcriptase
Type:
Protein Complex
Mol. Mass.:
Description:
Components:
This complex has 2 components.
Component 1
Name:
Gag-Pol polyprotein
Synonyms:
HIV-1 reverse transcriptase (HIV-1 RT) POL_HV1H2 Protease Reverse transcriptase (RT) gag-pol p66 RT
Type:
Protein
Mol. Mass.:
162074.74
Organism:
Human immunodeficiency virus type 1 group M subtype B (isolate HXB2)
Description:
P04585
Residue:
1435
  
Component 2
Name:
Gag-Pol polyprotein [588-1027]
Synonyms:
HIV-1 Reverse Transcriptase Chain B gag-pol
Type:
Enzyme Subunit
Mol. Mass.:
51337.13
Organism:
Human immunodeficiency virus type 1
Description:
P04585[588-1027]
Residue:
440
  
Inhibitor
Name:
BDBM27579
Synonyms:
AG 1549 Capravirine | {5-[(3,5-dichlorophenyl)sulfanyl]-4-(propan-2-yl)-1-(pyridin-4-ylmethyl)-1H-imidazol-2-yl}methyl carbamate
Type:
Small organic molecule
Emp. Form.:
C20H20Cl2N4O2S
Mol. Mass.:
451.369
SMILES:
CC(C)c1nc(COC(N)=O)n(Cc2ccncc2)c1Sc1cc(Cl)cc(Cl)c1
:
Substrate
Name:
poly r(A).oligo d(T)16
Synonyms:
Type:
RNA/DNA duplex
Mol. Mass.:
358.43
Organism:
Description:
Tritium-labeled TTP is co-substrate.
Residue:
3
NA