Target
Calmodulin-domain protein kinase 1
Ligand
BDBM50446172
Substrate
Meas. Tech.
Inhibition Assay
IC50
7.00±n/a nM
Citation
 Fan, EVan Voorhis, WCZhang, ZHuang, WOjo, KK 5-aminopyrazole-4-carboxamide inhibitors of CDPK1 from T. gondii and C. parvum US Patent  US9956214 Publication Date 5/1/2018 
Target
Name:
Calmodulin-domain protein kinase 1
Synonyms:
Calmodulin-domain protein kinase 1 Calmodulin-domain protein kinase, putative
Type:
Enzyme Catalytic Domain
Mol. Mass.:
57248.42
Organism:
Toxoplasma gondii
Description:
Residue:
507
  
Inhibitor
Name:
BDBM50446172
Synonyms:
CHEMBL3108997 US9956214, Compound 24
Type:
Small organic molecule
Emp. Form.:
C18H20N4O2
Mol. Mass.:
324.377
SMILES:
CC(C)(C)n1nc(c(C(N)=O)c1N)-c1ccc2cc(O)ccc2c1
: