Target
Bromodomain-containing protein 4
Ligand
BDBM390749
Substrate
Meas. Tech.
TR-FRET Assay (BD1: amino acids K57-E168)
Ki
0.800±n/a nM
Citation
 Dai, YFidanze, SDHasvold, LHolms, JLiu, DMcClellan, WMcDaniel, KMarjanovic, JSheppard, GWang, L Bromodomain inhibitors US Patent  US9957263 Publication Date 5/1/2018 
Target
Name:
Bromodomain-containing protein 4
Synonyms:
BRD4 Bromodomain-containing protein 4 (BRD4) Protein HUNK1
Type:
Protein
Mol. Mass.:
152264.84
Organism:
Homo sapiens (Human)
Description:
O60885
Residue:
1362
  
Inhibitor
Name:
BDBM390749
Synonyms:
US9957263, Example 11
Type:
Small organic molecule
Emp. Form.:
C23H19F2N3O6S
Mol. Mass.:
503.475
SMILES:
CCS(=O)(=O)Nc1cc(c(Oc2ccc(F)cc2F)cc1C(O)=O)-c1cn(C)c(=O)c2[nH]ccc12
: