Target
Oxysterols receptor LXR-alpha
Ligand
BDBM28144
Substrate
BDBM19993
Meas. Tech.
Radioligand Binding Assay and Luciferase Transcriptional Reporter Gene Assay
pH
7.4±n/a
Temperature
295.15±n/a K
IC50
12200±n/a nM
EC50
2750±n/a nM
Citation
 Ratni, HBlum-Kaelin, DDehmlow, HHartman, PJablonski, PMasciadri, RMaugeais, CPatiny-Adam, APanday, NWright, M Discovery of tetrahydro-cyclopenta[b]indole as selective LXRs modulator. Bioorg Med Chem Lett 19:1654-7 (2009)  
Target
Name:
Oxysterols receptor LXR-alpha
Synonyms:
LXRA Liver X receptor alpha Liver X receptor alpha (NR1H3) NR1H3 Nuclear orphan receptor LXR-alpha | Nuclear receptor subfamily 1 group H member 3
Type:
Enzyme Catalytic Domain
Mol. Mass.:
50403.85
Organism:
Homo sapiens (Human)
Description:
Q13133
Residue:
447
  
Inhibitor
Name:
BDBM28144
Synonyms:
methyl (2S)-2-[(2R)-7-chloro-1H,2H,3H,4H-cyclopenta[b]indol-2-yl]-2-fluoro-2-(pyridine-2-sulfonyl)acetate | tetrahydro-cyclopenta[b]indole, (+/-)24
Type:
Small organic molecule
Emp. Form.:
C19H16ClFN2O4S
Mol. Mass.:
422.858
SMILES:
[H][C@@]1(Cc2[nH]c3ccc(Cl)cc3c2C1)[C@@](F)(C(=O)OC)S(=O)(=O)c1ccccn1
:
Substrate
Name:
BDBM19993
Synonyms:
CHEMBL62136 T 0901317 TO-901317 US10669296, Compound TO901317 [3H]T0901317
Type:
Small organic molecule
Emp. Form.:
C17H12F9NO3S
Mol. Mass.:
481.333
SMILES:
OC(c1ccc(cc1)N(CC(F)(F)F)S(=O)(=O)c1ccccc1)(C(F)(F)F)C(F)(F)F
: