Target
High affinity nerve growth factor receptor
Ligand
BDBM249324
Substrate
Meas. Tech.
Measurement of TrkA Kinase-Inhibiting Activity Using Human TrkA-Expressing Cells
IC50
1.000±n/a nM
Citation
 Takeuchi, JItadani, SHashimura, KIkura, MHigashino, MYasuhiro, TNagaura, T Trk-inhibiting compound US Patent  US10300060 Publication Date 5/28/2019 
Target
Name:
High affinity nerve growth factor receptor
Synonyms:
2.7.10.1 NTRK1 NTRK1_HUMAN Neurotrophic tyrosine kinase receptor type 1 Synonyms=MTC TRK1-transforming tyrosine kinase protein TRKA GN Trk-A Tropomyosin-related kinase A Tyrosine kinase receptor Tyrosine kinase receptor A Tyrosine kinase receptor A (Trk-A) gp140trk | p140-TrkA
Type:
Mol. Mass.:
87498.18
Organism:
Homo sapiens (Human)
Description:
P04629
Residue:
796
  
Inhibitor
Name:
BDBM249324
Synonyms:
US10300060, Example 14-6 US9463192, 14-6 US9993479, 14-6
Type:
Small organic molecule
Emp. Form.:
C28H19F4N7O2
Mol. Mass.:
561.4898
SMILES:
Nc1ncc(F)cc1-c1ccc(Oc2ncc(NC(=O)Nc3cc(ccc3-c3cccnc3)C(F)(F)F)cn2)cc1
: