Target
High affinity nerve growth factor receptor
Ligand
BDBM249332
Substrate
Meas. Tech.
Measurement of TrkA Kinase-Inhibiting Activity Using Human TrkA-Expressing Cells
IC50
2.00±n/a nM
Citation
 Takeuchi, JItadani, SHashimura, KIkura, MHigashino, MYasuhiro, TNagaura, T Trk-inhibiting compound US Patent  US10300060 Publication Date 5/28/2019 
Target
Name:
High affinity nerve growth factor receptor
Synonyms:
2.7.10.1 NTRK1 NTRK1_HUMAN Neurotrophic tyrosine kinase receptor type 1 Synonyms=MTC TRK1-transforming tyrosine kinase protein TRKA GN Trk-A Tropomyosin-related kinase A Tyrosine kinase receptor Tyrosine kinase receptor A Tyrosine kinase receptor A (Trk-A) gp140trk | p140-TrkA
Type:
Mol. Mass.:
87498.18
Organism:
Homo sapiens (Human)
Description:
P04629
Residue:
796
  
Inhibitor
Name:
BDBM249332
Synonyms:
US10300060, Example 15-71 US9463192, 15-71 US9993479, 15-71
Type:
Small organic molecule
Emp. Form.:
C26H17Cl2F3N8O2
Mol. Mass.:
601.367
SMILES:
Nc1ncc(Cl)cc1-c1ccc(Oc2ncc(NC(=O)Nc3cc(Cl)ccc3-n3ccc(n3)C(F)(F)F)cn2)cc1
: