Target
High affinity nerve growth factor receptor
Ligand
BDBM249336
Substrate
Meas. Tech.
Measurement of TrkA Kinase-Inhibiting Activity Using Human TrkA-Expressing Cells
IC50
0.800±n/a nM
Citation
 Takeuchi, JItadani, SHashimura, KIkura, MHigashino, MYasuhiro, TNagaura, T Trk-inhibiting compound US Patent  US10300060 Publication Date 5/28/2019 
Target
Name:
High affinity nerve growth factor receptor
Synonyms:
2.7.10.1 NTRK1 NTRK1_HUMAN Neurotrophic tyrosine kinase receptor type 1 Synonyms=MTC TRK1-transforming tyrosine kinase protein TRKA GN Trk-A Tropomyosin-related kinase A Tyrosine kinase receptor Tyrosine kinase receptor A Tyrosine kinase receptor A (Trk-A) gp140trk | p140-TrkA
Type:
Mol. Mass.:
87498.18
Organism:
Homo sapiens (Human)
Description:
P04629
Residue:
796
  
Inhibitor
Name:
BDBM249336
Synonyms:
US10300060, Example 15-98 US9463192, 15-98 US9993479, 15-98
Type:
Small organic molecule
Emp. Form.:
C25H18F6N6O4S
Mol. Mass.:
612.504
SMILES:
CS(=O)(=O)c1ccc(cc1NC(=O)Nc1cnc(Oc2ccc(cc2)-c2cc(cnc2N)C(F)(F)F)nc1)C(F)(F)F
: