Target
High affinity nerve growth factor receptor
Ligand
BDBM249339
Substrate
Meas. Tech.
Measurement of TrkA Kinase-Inhibiting Activity Using Human TrkA-Expressing Cells
IC50
1.000±n/a nM
Citation
 Takeuchi, JItadani, SHashimura, KIkura, MHigashino, MYasuhiro, TNagaura, T Trk-inhibiting compound US Patent  US10300060 Publication Date 5/28/2019 
Target
Name:
High affinity nerve growth factor receptor
Synonyms:
2.7.10.1 NTRK1 NTRK1_HUMAN Neurotrophic tyrosine kinase receptor type 1 Synonyms=MTC TRK1-transforming tyrosine kinase protein TRKA GN Trk-A Tropomyosin-related kinase A Tyrosine kinase receptor Tyrosine kinase receptor A Tyrosine kinase receptor A (Trk-A) gp140trk | p140-TrkA
Type:
Mol. Mass.:
87498.18
Organism:
Homo sapiens (Human)
Description:
P04629
Residue:
796
  
Inhibitor
Name:
BDBM249339
Synonyms:
US10300060, Example 21-1 US9463192, 21-1 US9993479, 21-1
Type:
Small organic molecule
Emp. Form.:
C32H24F3N9O2
Mol. Mass.:
623.5873
SMILES:
FC(F)(F)c1ccc(c(NC(=O)Nc2cnc(Oc3ccc(cc3)-c3cnn4ccc(nc34)N3CCC3)nc2)c1)-c1cccnc1
: