Target
High affinity nerve growth factor receptor
Ligand
BDBM249340
Substrate
Meas. Tech.
Measurement of TrkA Kinase-Inhibiting Activity Using Human TrkA-Expressing Cells
IC50
1.000±n/a nM
Citation
 Takeuchi, JItadani, SHashimura, KIkura, MHigashino, MYasuhiro, TNagaura, T Trk-inhibiting compound US Patent  US10300060 Publication Date 5/28/2019 
Target
Name:
High affinity nerve growth factor receptor
Synonyms:
2.7.10.1 NTRK1 NTRK1_HUMAN Neurotrophic tyrosine kinase receptor type 1 Synonyms=MTC TRK1-transforming tyrosine kinase protein TRKA GN Trk-A Tropomyosin-related kinase A Tyrosine kinase receptor Tyrosine kinase receptor A Tyrosine kinase receptor A (Trk-A) gp140trk | p140-TrkA
Type:
Mol. Mass.:
87498.18
Organism:
Homo sapiens (Human)
Description:
P04629
Residue:
796
  
Inhibitor
Name:
BDBM249340
Synonyms:
US10300060, Example 21-2 US9463192, 21-2 US9993479, 21-2
Type:
Small organic molecule
Emp. Form.:
C31H25F3N10O2
Mol. Mass.:
626.5912
SMILES:
Cn1nccc1-c1ccc(cc1NC(=O)Nc1cnc(Oc2ccc(cc2)-c2cnn3ccc(nc23)N2CCC2)nc1)C(F)(F)F
: