Target
High affinity nerve growth factor receptor
Ligand
BDBM249346
Substrate
Meas. Tech.
Measurement of TrkA Kinase-Inhibiting Activity Using Human TrkA-Expressing Cells
IC50
4.00±n/a nM
Citation
 Takeuchi, JItadani, SHashimura, KIkura, MHigashino, MYasuhiro, TNagaura, T Trk-inhibiting compound US Patent  US10300060 Publication Date 5/28/2019 
Target
Name:
High affinity nerve growth factor receptor
Synonyms:
2.7.10.1 NTRK1 NTRK1_HUMAN Neurotrophic tyrosine kinase receptor type 1 Synonyms=MTC TRK1-transforming tyrosine kinase protein TRKA GN Trk-A Tropomyosin-related kinase A Tyrosine kinase receptor Tyrosine kinase receptor A Tyrosine kinase receptor A (Trk-A) gp140trk | p140-TrkA
Type:
Mol. Mass.:
87498.18
Organism:
Homo sapiens (Human)
Description:
P04629
Residue:
796
  
Inhibitor
Name:
BDBM249346
Synonyms:
US10300060, Example 21-67 US9463192, 21-67 US9993479, 21-67
Type:
Small organic molecule
Emp. Form.:
C33H27F3N8O2
Mol. Mass.:
624.6151
SMILES:
CCNc1ccn2ncc(-c3ccc(Oc4ncc(NC(=O)Nc5cc(ccc5-c5cccc(C)c5)C(F)(F)F)cn4)cc3)c2n1
: