Target
Dimer of Gag-Pol polyprotein [489-587]
Ligand
BDBM430
Substrate
Peptide substrate
Meas. Tech.
Protease Inhibition Assay
Ki
0.03±n/a nM
Citation
 Boyer, FEVara Prasad, JVDomagala, JMEllsworth, ELGajda, CHagen, SEMarkoski, LJTait, BDLunney, EAPalovsky, AFerguson, DGraham, NHoller, THupe, DNouhan, CTummino, PJUrumov, AZeikus, EZeikus, GGracheck, SJSanders, JMVanderRoest, SBrodfuehrer, JIyer, KSinz, MGulnik, SV 5,6-Dihydropyran-2-ones possessing various sulfonyl functionalities: potent nonpeptidic inhibitors of HIV protease. J Med Chem 43:843-58 (2000)  
Target
Name:
Dimer of Gag-Pol polyprotein [489-587]
Synonyms:
HIV-1 Protease
Type:
Protein Complex
Mol. Mass.:
Description:
Components:
This complex has 2 components.
Component 1
Name:
Gag-Pol polyprotein [489-587]
Synonyms:
HIV protease HIV-1 Protease chain A POL_HV1N5 | gag-pol
Type:
Enzyme Subunit
Mol. Mass.:
10822.21
Organism:
Human immunodeficiency virus type 1
Description:
P12497[489-587]
Residue:
99
  
Component 2
Name:
Gag-Pol polyprotein [489-587]
Synonyms:
HIV protease HIV-1 Protease chain A POL_HV1N5 | gag-pol
Type:
Enzyme Subunit
Mol. Mass.:
10822.21
Organism:
Human immunodeficiency virus type 1
Description:
P12497[489-587]
Residue:
99
  
Inhibitor
Name:
BDBM430
Synonyms:
3-[(2-tert-butyl-4-hydroxy-5-methylphenyl)sulfanyl]-4-hydroxy-6-[2-(4-hydroxyphenyl)ethyl]-6-(propan-2-yl)-5,6-dihydro-2H-pyran-2-one PD 178390 Analog 23
Type:
Small organic molecule
Emp. Form.:
C27H34O5S
Mol. Mass.:
470.621
SMILES:
CC(C)C1(CCc2ccc(O)cc2)CC(=O)C(Sc2cc(C)c(O)cc2C(C)(C)C)C(=O)O1
:
Substrate
Name:
Peptide substrate
Synonyms:
Type:
Peptide
Mol. Mass.:
3763.66
Organism:
Description:
Residue:
35