Target
Cytochrome P450 26A1
Ligand
BDBM50157605
Substrate
Meas. Tech.
Inhibition Assay
IC50
1900±n/a nM
Citation
 Diaz, PIsoherranen, NButtrick, BGuilloteau, N Specific inhibitors of cytochrome P450 26 retinoic acid hydroxylase US Patent  US9963439 Publication Date 5/8/2018 
Target
Name:
Cytochrome P450 26A1
Synonyms:
CP26A_HUMAN CYP26A1 Cytochrome P450 26A1 P450RAI1 | Retinoic acid 4-hydroxylase
Type:
Enzyme
Mol. Mass.:
56216.16
Organism:
Homo sapiens (Human)
Description:
O43174
Residue:
497
  
Inhibitor
Name:
BDBM50157605
Synonyms:
Liarozole R-75251 | US9963439, Liarozole
Type:
Small organic molecule
Emp. Form.:
C17H13ClN4
Mol. Mass.:
308.765
SMILES:
Clc1cccc(c1)C(c1ccc2[nH]cnc2c1)n1ccnc1
: