Target
Protein Wnt-3a
Ligand
BDBM263601
Substrate
Meas. Tech.
WNT Pathway Reporter Gene Assay
IC50
8.00±n/a nM
Citation
 An, S Compounds for treatment of cancer US Patent  US9713612 Publication Date 7/25/2017 
Target
Name:
Protein Wnt-3a
Synonyms:
WNT3A | WNT3A_HUMAN
Type:
PROTEIN
Mol. Mass.:
39379.02
Organism:
Homo sapiens (Human)
Description:
ChEMBL_1469237
Residue:
352
  
Inhibitor
Name:
BDBM263601
Synonyms:
US10087181, Compound 107 US9713612, 108
Type:
Small organic molecule
Emp. Form.:
C28H22N6
Mol. Mass.:
442.5145
SMILES:
Cc1cc(ccn1)-c1cc2ccnc(NCc3ccc(-c4ccnc(C)c4)c(c3)C#N)c2cn1
: