Target
Cannabinoid receptor 1
Ligand
BDBM29066
Substrate
BDBM21278
Meas. Tech.
CB1 Radioligand Binding Assay (Ki) and GTP-gamma-[35S] Binding Assay (EC50)
pH
7.4±n/a
Temperature
303.15±n/a K
Ki
4.7±n/a nM
EC50
11±n/a nM
Citation
 Dow, RLCarpino, PAHadcock, JRBlack, SCIredale, PADaSilva-Jardine, PSchneider, SRPaight, ESGriffith, DAScott, DOO'Connor, RENduaka, CI Discovery of 2-(2-chlorophenyl)-3-(4-chlorophenyl)-7-(2,2-difluoropropyl)-6,7-dihydro-2H-pyrazolo[3,4-f][1,4]oxazepin-8(5H)-one (PF-514273), a novel, bicyclic lactam-based cannabinoid-1 receptor antagonist for the treatment of obesity. J Med Chem 52:2652-5 (2009)  
Target
Name:
Cannabinoid receptor 1
Synonyms:
CANN6 CB-R CNR CNR1_HUMAN Cannabinoid receptor Cannabinoid receptor 1 (brain)
Type:
G Protein-Coupled Receptor (GPCR)
Mol. Mass.:
52868.96
Organism:
Homo sapiens (Human)
Description:
P21554
Residue:
472
  
Inhibitor
Name:
BDBM29066
Synonyms:
lactam-based compound, 12e
Type:
Small organic molecule
Emp. Form.:
C22H21Cl2N3O
Mol. Mass.:
414.328
SMILES:
CC(C)(C)N1CCc2c(nn(c2-c2ccc(Cl)cc2)-c2ccccc2Cl)C1=O
:
Substrate
Name:
BDBM21278
Synonyms:
5-(4-chlorophenyl)-1-(2,4-dichlorophenyl)-4-methyl-N-(piperidin-1-yl)-1H-pyrazole-3-carboxamide CHEMBL111 RIMONABANT HYDROCHLORIDE SR 141716A SR141716A [3H]SR141716A
Type:
Small organic molecule
Emp. Form.:
C22H21Cl3N4O
Mol. Mass.:
463.787
SMILES:
Cc1c(nn(c1-c1ccc(Cl)cc1)-c1ccc(Cl)cc1Cl)C(=O)NN1CCCCC1
: