Target
Cannabinoid receptor 1
Ligand
BDBM29101
Substrate
BDBM21278
Meas. Tech.
CB Receptor Radioligand Binding Assay (Ki)
pH
7.2±n/a
Temperature
295.15±n/a K
Ki
1.2±n/a nM
Citation
 Pettersson, HBülow, AEk, FJensen, JOttesen, LKFejzic, AMa, JNDel Tredici, ALCurrier, EAGardell, LRTabatabaei, ACraig, DMcFarland, KOtt, TRPiu, FBurstein, ESOlsson, R Synthesis and evaluation of dibenzothiazepines: a novel class of selective cannabinoid-1 receptor inverse agonists. J Med Chem 52:1975-82 (2009)  
Target
Name:
Cannabinoid receptor 1
Synonyms:
CANN6 CB-R CNR CNR1_HUMAN Cannabinoid receptor Cannabinoid receptor 1 (brain)
Type:
G Protein-Coupled Receptor (GPCR)
Mol. Mass.:
52868.96
Organism:
Homo sapiens (Human)
Description:
P21554
Residue:
472
  
Inhibitor
Name:
BDBM29101
Synonyms:
dibenzothiazepine, 12j
Type:
Small organic molecule
Emp. Form.:
C22H19ClN2OS2
Mol. Mass.:
426.982
SMILES:
CC(C)CNC(=O)c1ccc2Sc3ccccc3C(=Nc2c1)c1ccc(Cl)s1
:
Substrate
Name:
BDBM21278
Synonyms:
5-(4-chlorophenyl)-1-(2,4-dichlorophenyl)-4-methyl-N-(piperidin-1-yl)-1H-pyrazole-3-carboxamide CHEMBL111 RIMONABANT HYDROCHLORIDE SR 141716A SR141716A [3H]SR141716A
Type:
Small organic molecule
Emp. Form.:
C22H21Cl3N4O
Mol. Mass.:
463.787
SMILES:
Cc1c(nn(c1-c1ccc(Cl)cc1)-c1ccc(Cl)cc1Cl)C(=O)NN1CCCCC1
: