Target
Type-2 angiotensin II receptor
Ligand
BDBM395232
Substrate
Meas. Tech.
AT2 Receptor Binding Assay
Ki
15.0±n/a nM
Citation
 Brown, JMcCarthy, TDNaylor, AWatts, JP Heterocyclic compounds and methods for their use US Patent  US10308628 Publication Date 6/4/2019 
Target
Name:
Type-2 angiotensin II receptor
Synonyms:
AGTR2 AT2 Angiotensin II type 2 (AT-2) receptor Type-2 angiotensin II receptor
Type:
Enzyme Catalytic Domain
Mol. Mass.:
41201.61
Organism:
Homo sapiens (Human)
Description:
Angiotensin II, central 0 0::P50052
Residue:
363
  
Inhibitor
Name:
BDBM395232
Synonyms:
US10308628, Compound 4
Type:
Small organic molecule
Emp. Form.:
C29H30N2O4
Mol. Mass.:
470.5595
SMILES:
OC(=O)[C@@H]1C[C@@H](CCN1C(=O)C(c1ccccc1)c1ccccc1)N1CCCOc2ccccc12
: