Target
Type-2 angiotensin II receptor
Ligand
BDBM395233
Substrate
Meas. Tech.
AT2 Receptor Binding Assay
Ki
9.00±n/a nM
Citation
 Brown, JMcCarthy, TDNaylor, AWatts, JP Heterocyclic compounds and methods for their use US Patent  US10308628 Publication Date 6/4/2019 
Target
Name:
Type-2 angiotensin II receptor
Synonyms:
AGTR2 AT2 Angiotensin II type 2 (AT-2) receptor Type-2 angiotensin II receptor
Type:
Enzyme Catalytic Domain
Mol. Mass.:
41201.61
Organism:
Homo sapiens (Human)
Description:
Angiotensin II, central 0 0::P50052
Residue:
363
  
Inhibitor
Name:
BDBM395233
Synonyms:
US10308628, Compound 5
Type:
Small organic molecule
Emp. Form.:
C31H34N2O4
Mol. Mass.:
498.6127
SMILES:
COc1ccc2N(CCCCc2c1)[C@@H]1CCN([C@@H](C1)C(O)=O)C(=O)C(c1ccccc1)c1ccccc1
: