Target
Alkaline phosphatase, germ cell type
Ligand
BDBM396274
Substrate
Meas. Tech.
Alkaline Phosphatase Assay
EC50
<20±n/a nM
Citation
 Castro, ACGrogan, MJMcGovern, KJTremblay, MR Methods of use of cyclopamine analogs US Patent  US10314827 Publication Date 6/11/2019 
Target
Name:
Alkaline phosphatase, germ cell type
Synonyms:
ALPG ALPPL2 PPBN_HUMAN | placental-like alkaline phosphatase preproprotein
Type:
PROTEIN
Mol. Mass.:
57374.31
Organism:
Homo sapiens (Human)
Description:
ChEMBL_29964
Residue:
532
  
Inhibitor
Name:
BDBM396274
Synonyms:
US10314827, Compound 23
Type:
Small organic molecule
Emp. Form.:
C39H56N2O3
Mol. Mass.:
600.8735
SMILES:
C[C@@H]1[C@H]2[C@@H](C[C@H](C)CN2CCNC(=O)CCc2ccccc2)O[C@]11CC[C@H]2[C@@H]3CC[C@@H]4CC(=O)CC[C@]4(C)[C@H]3CC2=C(C)C1
: