Target
5-hydroxytryptamine receptor 1A
Ligand
BDBM30725
Substrate
Not Available
Meas. Tech.
Dose Response Assay for Agonists of 5-Hydroxytryptamine (Serotonin) Receptor Subtype 1A (5HT1A)
pH
7.4±n/a
Temperature
296.15±n/a K
EC50
41400±n/a nM
Citation
 PubChem, PC Dose Response Assay for 5-Hydroxytryptamine (Serotonin) Receptor Subtype 1a (5HT1a) Agonists PubChem Bioassay (2007)[AID] 
Target
Name:
5-hydroxytryptamine receptor 1A
Synonyms:
5-HT-1A 5-hydroxytryptamine receptor 1A (5-HT-1A) ADRB2RL1 Dopamine D2 receptor and serotonin 1a receptor HTR1A | Serotonin receptor 1A
Type:
Mol. Mass.:
46122.49
Organism:
Homo sapiens (Human)
Description:
Residue:
422
  
Inhibitor
Name:
BDBM30725
Synonyms:
MLS000079925 N-[3-cyano-1-(4-methoxyphenyl)pyrrolo[3,2-b]quinoxalin-2-yl]-2-furamide SMR000039887 | cid_658939
Type:
Small organic molecule
Emp. Form.:
C23H15N5O3
Mol. Mass.:
409.3969
SMILES:
COc1ccc(cc1)-n1c(NC(=O)c2ccco2)c(C#N)c2nc3ccccc3nc12
:
Substrate
Name:
Not Available
Synonyms:
Type:
Mol. Mass.:
358.43
Organism:
Description:
Residue:
3
NA